BDBM50004951 CHEMBL2392434
SMILES CC1=NN(C(=O)C1)c1cccc(c1)S(N)(=O)=O
InChI Key InChIKey=ASVVGQURNHNITH-UHFFFAOYSA-N
Data  3 IC50
PDB links: 1 PDB ID matches this monomer.
  Tab Delimited (TSV)   2D SDfile   Computed 3D by Vconf -m prep SDfile
Find this compound or compounds like it in BindingDB:
Activity Spreadsheet -- Enzyme Inhibition Constant Data from BindingDB
Found 3 hits for monomerid = 50004951
TargetCarbonic anhydrase 9(Homo sapiens (Human))
East China University Of Science And Technology
Curated by ChEMBL
LigandPNGBDBM50004951(CHEMBL2392434)
Affinity DataIC50:  588nM. Assay description: Inhibition of GST-tagged recombinant carbonic anhydrase-9 catalytic domain (unknown origin)
In DepthDetails ArticlePubMed
TargetCarbonic anhydrase 1(Homo sapiens (Human))
East China University Of Science And Technology
Curated by ChEMBL
LigandPNGBDBM50004951(CHEMBL2392434)
Affinity DataIC50:  1.19E+3nM. Assay description: Inhibition of full length carbonic anhydrase-1 in human erythrocytes
In DepthDetails ArticlePubMed
TargetCarbonic anhydrase 2(Homo sapiens (Human))
East China University Of Science And Technology
Curated by ChEMBL
LigandPNGBDBM50004951(CHEMBL2392434)
Affinity DataIC50:  809nM. Assay description: Inhibition of full length carbonic anhydrase-2 in human erythrocytes
In DepthDetails ArticlePubMed