BDBM50004953 CHEMBL2392433
SMILES COc1ccc(CNc2ccc(cc2)S(N)(=O)=O)cc1OC
InChI Key InChIKey=NWKIKRYRNPYMHH-UHFFFAOYSA-N
Data  3 IC50
  Tab Delimited (TSV)   2D SDfile   Computed 3D by Vconf -m prep SDfile
Find this compound or compounds like it in BindingDB:
Activity Spreadsheet -- Enzyme Inhibition Constant Data from BindingDB
Found 3 hits for monomerid = 50004953
TargetCarbonic anhydrase 9(Homo sapiens (Human))
East China University Of Science And Technology
Curated by ChEMBL
LigandPNGBDBM50004953(CHEMBL2392433)
Affinity DataIC50:  342nM. Assay description: Inhibition of GST-tagged recombinant carbonic anhydrase-9 catalytic domain (unknown origin)
In DepthDetails ArticlePubMed
TargetCarbonic anhydrase 1(Homo sapiens (Human))
East China University Of Science And Technology
Curated by ChEMBL
LigandPNGBDBM50004953(CHEMBL2392433)
Affinity DataIC50:  120nM. Assay description: Inhibition of full length carbonic anhydrase-1 in human erythrocytes
In DepthDetails ArticlePubMed
TargetCarbonic anhydrase 2(Homo sapiens (Human))
East China University Of Science And Technology
Curated by ChEMBL
LigandPNGBDBM50004953(CHEMBL2392433)
Affinity DataIC50:  13nM. Assay description: Inhibition of full length carbonic anhydrase-2 in human erythrocytes
In DepthDetails ArticlePubMed