BDBM50004958 CHEMBL2392430
SMILES NS(=O)(=O)c1cccc(NS(=O)(=O)c2ccc3NC(=O)c4cccc2c34)c1
InChI Key InChIKey=YNFOLILQKBBXEM-UHFFFAOYSA-N
Data  3 IC50
  Tab Delimited (TSV)   2D SDfile   Computed 3D by Vconf -m prep SDfile
Find this compound or compounds like it in BindingDB:
Activity Spreadsheet -- Enzyme Inhibition Constant Data from BindingDB
Found 3 hits for monomerid = 50004958
TargetCarbonic anhydrase 9(Homo sapiens (Human))
East China University Of Science And Technology
Curated by ChEMBL
LigandPNGBDBM50004958(CHEMBL2392430)
Affinity DataIC50:  28nM. Assay description: Inhibition of GST-tagged recombinant carbonic anhydrase-9 catalytic domain (unknown origin)
In DepthDetails ArticlePubMed
TargetCarbonic anhydrase 1(Homo sapiens (Human))
East China University Of Science And Technology
Curated by ChEMBL
LigandPNGBDBM50004958(CHEMBL2392430)
Affinity DataIC50:  231nM. Assay description: Inhibition of full length carbonic anhydrase-1 in human erythrocytes
In DepthDetails ArticlePubMed
TargetCarbonic anhydrase 2(Homo sapiens (Human))
East China University Of Science And Technology
Curated by ChEMBL
LigandPNGBDBM50004958(CHEMBL2392430)
Affinity DataIC50:  3.87E+3nM. Assay description: Inhibition of full length carbonic anhydrase-2 in human erythrocytes
In DepthDetails ArticlePubMed