BDBM50005009 CHEMBL2397311
SMILES Cc1nc(NC(=O)C2(C)CCCCC2)sc1-c1ccc(N)nc1
InChI Key InChIKey=HFFDHCIWKMSYST-UHFFFAOYSA-N
Data  2 IC50
  Tab Delimited (TSV)   2D SDfile   Computed 3D by Vconf -m prep SDfile
Find this compound or compounds like it in BindingDB:
Activity Spreadsheet -- Enzyme Inhibition Constant Data from BindingDB
Found 2 hits for monomerid = 50005009
TargetCytochrome P450 3A4(Homo sapiens (Human))
Boehringer Ingelheim (Canada)
Curated by ChEMBL
LigandPNGBDBM50005009(CHEMBL2397311)
Affinity DataIC50:  1.70E+4nM. Assay description: Inhibition of CYP3A4 (unknown origin)
In DepthDetails ArticlePubMed
TargetPhosphatidylinositol 4-kinase beta(Homo sapiens (Human))
Boehringer Ingelheim (Canada)
Curated by ChEMBL
LigandPNGBDBM50005009(CHEMBL2397311)
Affinity DataIC50:  40nM. Assay description: Inhibition of PI4K3beta (unknown origin)
In DepthDetails ArticlePubMed