BDBM50005033 CHEMBL1915517
SMILES CCCOc1ccc(cc1-c1nc(CC)c(F)c(=O)[nH]1)S(=O)(=O)N1CCN(C)CC1
InChI Key InChIKey=MMOIQVJIHPNAIU-UHFFFAOYSA-N
Data  1 Kd
PDB links: 1 PDB ID matches this monomer.
  Tab Delimited (TSV)   2D SDfile   Computed 3D by Vconf -m prep SDfile
Find this compound or compounds like it in BindingDB:
Activity Spreadsheet -- Enzyme Inhibition Constant Data from BindingDB
Found 1 hit for monomerid = 50005033
TargetcGMP-specific 3',5'-cyclic phosphodiesterase(Homo sapiens (Human))
Chinese Academy Of Sciences (Cas)
Curated by ChEMBL
LigandPNGBDBM50005033(CHEMBL1915517)
Affinity DataKd:  1.70E+3nM. Assay description: Binding affinity to recombinant PDE5 catalytic domain (unknown origin) by ITC analysis