BDBM50005093 CHEBI:3978::CYANIN
SMILES OC[C@H]1O[C@@H](Oc2cc3c(O[C@@H]4O[C@H](CO)[C@@H](O)[C@H](O)[C@H]4O)cc(O)cc3[o+]c2-c2ccc(O)c(O)c2)[C@H](O)[C@@H](O)[C@@H]1O
InChI Key InChIKey=RDFLLVCQYHQOBU-ZOTFFYTFSA-O
Data  1 IC50  1 Kd
  Tab Delimited (TSV)   2D SDfile   Computed 3D by Vconf -m prep SDfile
Find this compound or compounds like it in BindingDB:
Activity Spreadsheet -- Enzyme Inhibition Constant Data from BindingDB
Found 2 hits for monomerid = 50005093
TargetProthrombin(Homo sapiens (Human))
University Of Lodz
Curated by ChEMBL
LigandPNGBDBM50005093(CHEBI:3978 | CYANIN)
Affinity DataIC50:  7.50E+4nM. Assay description: Inhibition of human thrombin amidolytic activity using D-Phe-Pip-Arg-pNA as substrate preincubated for 10 mins followed by substrate addition measure...
In DepthDetails ArticlePubMed
TargetProthrombin(Homo sapiens (Human))
University Of Lodz
Curated by ChEMBL
LigandPNGBDBM50005093(CHEBI:3978 | CYANIN)
Affinity DataKd:  8.63E+6nM. Assay description: Inhibition of human thrombin assessed as equilibrium dissociation constant at 50 to 1000 uM by BIAcore analysis
In DepthDetails ArticlePubMed