BDBM50005223 2-{[Acetyl-(5-heptadecyl-tetrahydro-furan-3-ylmethoxycarbonyl)-amino]-methyl}-1-ethyl-pyridinium; iodide::CHEMBL124071
SMILES CCCCCCCCCCCCCCCCCC1CC(COC(=O)N(Cc2cccc[n+]2CC)C(C)=O)CO1
InChI Key InChIKey=KJZDYLVVJCYDBH-UHFFFAOYSA-N
Data  2 IC50
  Tab Delimited (TSV)   2D SDfile   Computed 3D by Vconf -m prep SDfile
Find this compound or compounds like it in BindingDB:
Activity Spreadsheet -- Enzyme Inhibition Constant Data from BindingDB
Found 2 hits for monomerid = 50005223
TargetPlatelet-activating factor receptor(Cavia porcellus)
J. Uriach & CíA.
Curated by ChEMBL
LigandPNGBDBM50005223(2-{[Acetyl-(5-heptadecyl-tetrahydro-furan-3-ylmeth...)
Affinity DataIC50:  210nM. Assay description: Inhibitory activity expressed as the concentration required to inhibit platelet-activating factor (PAF) induced maximum aggregation by 50%
In DepthDetails ArticlePubMed
TargetPlatelet-activating factor receptor(Cavia porcellus)
J. Uriach & CíA.
Curated by ChEMBL
LigandPNGBDBM50005223(2-{[Acetyl-(5-heptadecyl-tetrahydro-furan-3-ylmeth...)
Affinity DataIC50:  210nM. Assay description: In vitro inhibition of PAF induced aggregation of rabbit platelets.
In DepthDetails ArticlePubMed