BDBM50005224 2-({Acetyl-[5-(16-methoxy-hexadecyloxy)-tetrahydro-furan-3-ylmethoxycarbonyl]-amino}-methyl)-1-ethyl-pyridinium; iodide::CHEMBL158974
SMILES CC[n+]1ccccc1CN(C(C)=O)C(=O)OCC1COC(C1)OCCCCCCCCCCCCCCCCOC
InChI Key InChIKey=GMHWSJTUCKIFIV-UHFFFAOYSA-N
Data  1 IC50
  Tab Delimited (TSV)   2D SDfile   Computed 3D by Vconf -m prep SDfile
Find this compound or compounds like it in BindingDB:
Activity Spreadsheet -- Enzyme Inhibition Constant Data from BindingDB
Found 1 hit for monomerid = 50005224
TargetPlatelet-activating factor receptor(Cavia porcellus)
J. Uriach & CíA.
Curated by ChEMBL
LigandPNGBDBM50005224(2-({Acetyl-[5-(16-methoxy-hexadecyloxy)-tetrahydro...)
Affinity DataIC50:  2.10nM. Assay description: In vitro inhibition of PAF induced aggregation of rabbit platelets.
In DepthDetails ArticlePubMed