BDBM50005228 2-[(Acetyl-{5-[6-(3-phenyl-propoxy)-hexyloxy]-tetrahydro-furan-3-ylmethoxycarbonyl}-amino)-methyl]-1-ethyl-pyridinium; iodide::CHEMBL162251
SMILES CC[n+]1ccccc1CN(C(C)=O)C(=O)OCC1COC(C1)OCCCCCCOCCCc1ccccc1
InChI Key InChIKey=ZPRTXMCKEPWEJU-UHFFFAOYSA-N
Data  1 IC50
  Tab Delimited (TSV)   2D SDfile   Computed 3D by Vconf -m prep SDfile
Find this compound or compounds like it in BindingDB:
Activity Spreadsheet -- Enzyme Inhibition Constant Data from BindingDB
Found 1 hit for monomerid = 50005228
TargetPlatelet-activating factor receptor(Cavia porcellus)
J. Uriach & CíA.
Curated by ChEMBL
LigandPNGBDBM50005228(2-[(Acetyl-{5-[6-(3-phenyl-propoxy)-hexyloxy]-tetr...)
Affinity DataIC50:  51nM. Assay description: In vitro inhibition of PAF induced aggregation of rabbit platelets.
In DepthDetails ArticlePubMed