BDBM50005229 2-{[Acetyl-(5-octadecyloxy-tetrahydro-furan-3-ylmethoxycarbonyl)-amino]-methyl}-1-ethyl-pyridinium; chloride::2-{[Acetyl-(5-octadecyloxy-tetrahydro-furan-3-ylmethoxycarbonyl)-amino]-methyl}-1-ethyl-pyridinium; iodide::CHEMBL290840
SMILES CCCCCCCCCCCCCCCCCCOC1CC(COC(=O)N(Cc2cccc[n+]2CC)C(C)=O)CO1
InChI Key InChIKey=AEBQYQRMRZSJQU-UHFFFAOYSA-N
Data  3 IC50
  Tab Delimited (TSV)   2D SDfile   Computed 3D by Vconf -m prep SDfile
Find this compound or compounds like it in BindingDB:
Activity Spreadsheet -- Enzyme Inhibition Constant Data from BindingDB
Found 3 hits for monomerid = 50005229
TargetPlatelet-activating factor receptor(Cavia porcellus)
J. Uriach & CíA.
Curated by ChEMBL
LigandPNGBDBM50005229(2-{[Acetyl-(5-octadecyloxy-tetrahydro-furan-3-ylme...)
Affinity DataIC50:  13nM. Assay description: In vitro inhibition of PAF induced aggregation of rabbit platelets.
In DepthDetails ArticlePubMed
TargetPlatelet-activating factor receptor(Cavia porcellus)
J. Uriach & CíA.
Curated by ChEMBL
LigandPNGBDBM50005229(2-{[Acetyl-(5-octadecyloxy-tetrahydro-furan-3-ylme...)
Affinity DataIC50:  21nM. Assay description: In vitro inhibition of PAF induced aggregation of rabbit platelets.
In DepthDetails ArticlePubMed
TargetPlatelet-activating factor receptor(Homo sapiens (Human))
TBA
Curated by ChEMBL
LigandPNGBDBM50005229(2-{[Acetyl-(5-octadecyloxy-tetrahydro-furan-3-ylme...)
Affinity DataIC50:  12nM. Assay description: In vitro inhibition of [3H]PAF receptor binding to washed human platelet membranes
In DepthDetails Article