BDBM50005258 CHEMBL18762::D-367::[2-(4-Bromo-2,5-dimethoxy-phenyl)-1-methyl-ethyl]-propyl-amine::[2-(4-Bromo-2,5-dimethoxy-phenyl)-1-methyl-ethyl]-propyl-amine(N-n-Pr-DOB)
SMILES CCCNC(C)Cc1cc(OC)c(Br)cc1OC
InChI Key InChIKey=UGQKMZIPUUQGHA-UHFFFAOYSA-N
Data  10 KI
  Tab Delimited (TSV)   2D SDfile   Computed 3D by Vconf -m prep SDfile
Find this compound or compounds like it in BindingDB:
Activity Spreadsheet -- Enzyme Inhibition Constant Data from BindingDB
Found 10 hits for monomerid = 50005258
Target5-hydroxytryptamine receptor 2A(Homo sapiens (Human))
Virginia Commonwealth University
Curated by ChEMBL
LigandPNGBDBM50005258(CHEMBL18762 | D-367 | [2-(4-Bromo-2,5-dimethoxy-ph...)
Affinity DataKi:  89nM. Assay description: Compound was tested for its ability to inhibit high affinity uptake of [3H]DA into rat striatal membrane
In DepthDetails ArticlePubMed
Target5-hydroxytryptamine receptor 2C(Homo sapiens (Human))
Eli Lilly
Curated by PDSP Ki Database
LigandPNGBDBM50005258(CHEMBL18762 | D-367 | [2-(4-Bromo-2,5-dimethoxy-ph...)
Affinity DataKi:  514nM
In DepthDetails ArticlePubMed
Target5-hydroxytryptamine receptor 2B(Homo sapiens (Human))
Eli Lilly
Curated by PDSP Ki Database
LigandPNGBDBM50005258(CHEMBL18762 | D-367 | [2-(4-Bromo-2,5-dimethoxy-ph...)
Affinity DataKi:  521nM
In DepthDetails ArticlePubMed
LigandPNGBDBM50005258(CHEMBL18762 | D-367 | [2-(4-Bromo-2,5-dimethoxy-ph...)
Affinity DataKi:  976nM
In DepthDetails ArticlePubMed
LigandPNGBDBM50005258(CHEMBL18762 | D-367 | [2-(4-Bromo-2,5-dimethoxy-ph...)
Affinity DataKi:  1.32E+3nM. Assay description: Evaluated for binding affinity towards rat cortical membranes at 5-hydroxytryptamine 1 receptor binding site by using [3H]-5-HT as a radioligand.
In DepthDetails ArticlePubMed
LigandPNGBDBM50005258(CHEMBL18762 | D-367 | [2-(4-Bromo-2,5-dimethoxy-ph...)
Affinity DataKi:  1.32E+3nM. Assay description: Binding affinity for 5-hydroxytryptamine 1 receptor of rat prefrontal cortex
In DepthDetails ArticlePubMed
TargetSerotonin 2 (5-HT2) receptor(RAT)
TBA
Curated by ChEMBL
LigandPNGBDBM50005258(CHEMBL18762 | D-367 | [2-(4-Bromo-2,5-dimethoxy-ph...)
Affinity DataKi:  1.93E+3nM. Assay description: Displacement of [3H]ketanserin from rat prefrontal cortex 5-hydroxytryptamine 2 receptor
In DepthDetails ArticlePubMed
TargetSerotonin 2 (5-HT2) receptor(RAT)
TBA
Curated by ChEMBL
LigandPNGBDBM50005258(CHEMBL18762 | D-367 | [2-(4-Bromo-2,5-dimethoxy-ph...)
Affinity DataKi:  1.93E+3nM. Assay description: Binding affinity to rat cortical membranes at 5-hydroxytryptamine 2 (5-HT2) receptor using [3H]KET as a radioligand
In DepthDetails ArticlePubMed
TargetSerotonin 2 (5-HT2) receptor(RAT)
TBA
Curated by ChEMBL
LigandPNGBDBM50005258(CHEMBL18762 | D-367 | [2-(4-Bromo-2,5-dimethoxy-ph...)
Affinity DataKi:  2.46E+3nM. Assay description: Binding affinity towards 5-hydroxytryptamine 2 receptor from frontal cortical regions of male Sprague-Dawley rat homogenates, using [3H]ketanserin as...
In DepthDetails ArticlePubMed
Target5-hydroxytryptamine receptor 2C(Rattus norvegicus (Rat))
Virginia Commonwealth University
Curated by ChEMBL
LigandPNGBDBM50005258(CHEMBL18762 | D-367 | [2-(4-Bromo-2,5-dimethoxy-ph...)
Affinity DataKi: >1.00E+4nM. Assay description: Binding affinity towards 5-hydroxytryptamine 1C receptor from frontal cortical regions of male Sprague-Dawley rat homogenates, using [3H]mesulergine ...
In DepthDetails ArticlePubMed