BDBM50005431 CHEMBL8665::N-[(1-Cyclohexylmethyl-2,3-dihydroxy-5-methyl-hexylcarbamoyl)-propoxy-methyl]-2-(morpholine-4-sulfonylamino)-3-phenyl-propionamide
SMILES CCCOC(NC(=O)[C@H](Cc1ccccc1)NS(=O)(=O)N1CCOCC1)C(=O)N[C@@H](CC1CCCCC1)[C@@H](O)[C@@H](O)CC(C)C
InChI Key InChIKey=QYPDSNCYTUHFDC-GDZMZIAQSA-N
Data  2 IC50
  Tab Delimited (TSV)   2D SDfile   Computed 3D by Vconf -m prep SDfile
Find this compound or compounds like it in BindingDB:
Activity Spreadsheet -- Enzyme Inhibition Constant Data from BindingDB
Found 2 hits for monomerid = 50005431
TargetCathepsin D(Bos taurus)
Warner-Lambert
Curated by ChEMBL
LigandPNGBDBM50005431(CHEMBL8665 | N-[(1-Cyclohexylmethyl-2,3-dihydroxy-...)
Affinity DataIC50:  22nM. Assay description: Inhibitory activity against bovine cathepsin D
In DepthDetails ArticlePubMed
TargetRenin(Homo sapiens (Human))
Warner-Lambert
Curated by ChEMBL
LigandPNGBDBM50005431(CHEMBL8665 | N-[(1-Cyclohexylmethyl-2,3-dihydroxy-...)
Affinity DataIC50:  0.210nM. Assay description: Inhibitory activity against monkey renin in vitro.
In DepthDetails ArticlePubMed