BDBM50005438 3-Hydroxy-4-[2-isopropylsulfanyl-2-(3-naphthalen-1-yl-2-naphthalen-1-ylmethyl-propionylamino)-acetylamino]-6-methyl-heptanoic acid (2-methyl-butyl)-amide::CHEMBL3350028
SMILES CC[C@H](C)CNC(=O)C[C@H](O)[C@H](CC(C)C)NC(=O)C(NC(=O)C(Cc1cccc2ccccc12)Cc1cccc2ccccc12)SC(C)C
InChI Key InChIKey=SZRPDUCWYCTFEB-WATDRHPISA-N
Data  2 IC50
  Tab Delimited (TSV)   2D SDfile   Computed 3D by Vconf -m prep SDfile
Find this compound or compounds like it in BindingDB:
Activity Spreadsheet -- Enzyme Inhibition Constant Data from BindingDB
Found 2 hits for monomerid = 50005438
TargetRenin(Homo sapiens (Human))
Warner-Lambert
Curated by ChEMBL
LigandPNGBDBM50005438(3-Hydroxy-4-[2-isopropylsulfanyl-2-(3-naphthalen-1...)
Affinity DataIC50: >1.00E+3nM. Assay description: Inhibitory activity against monkey renin in vitro.
In DepthDetails ArticlePubMed
TargetRenin(Homo sapiens (Human))
Warner-Lambert
Curated by ChEMBL
LigandPNGBDBM50005438(3-Hydroxy-4-[2-isopropylsulfanyl-2-(3-naphthalen-1...)
Affinity DataIC50:  95nM. Assay description: Inhibitory activity against monkey renin in vitro.
In DepthDetails ArticlePubMed