BDBM50005465 4-Chloro-N-(3,3-diphenyl-allyl)-benzamide::CHEMBL268197
SMILES Clc1ccc(cc1)-[#6](=O)-[#7]-[#6]\[#6]=[#6](\c1ccccc1)-c1ccccc1
InChI Key InChIKey=BNKPMAVKOSNGEL-UHFFFAOYSA-N
Data  1 KI
  Tab Delimited (TSV)   2D SDfile   Computed 3D by Vconf -m prep SDfile
Find this compound or compounds like it in BindingDB:
Activity Spreadsheet -- Enzyme Inhibition Constant Data from BindingDB
Found 1 hit for monomerid = 50005465
TargetCholecystokinin receptor type A(RAT)
Center For Bio-Pharmaceutical Sciences
Curated by ChEMBL
LigandPNGBDBM50005465(4-Chloro-N-(3,3-diphenyl-allyl)-benzamide | CHEMBL...)
Affinity DataKi: >2.00E+3nM. Assay description: Inhibition of [3H]-L-364,718 binding to cholecystokinin type A receptor in rat pancreas membranes
In DepthDetails ArticlePubMed