BDBM50005575 3-Benzoyloxy-8-methyl-8-aza-bicyclo[3.2.1]octane-2-carboxylic acid 2-(4-amino-phenyl)-ethyl ester::CHEMBL175251
SMILES CN1[C@@H]2CCC1C([C@H](C2)OC(=O)c1ccccc1)C(=O)OCCc1ccc(N)cc1
InChI Key InChIKey=SCOHSAGQPWTNRN-AEAFLJPSSA-N
Data  2 IC50
  Tab Delimited (TSV)   2D SDfile   Computed 3D by Vconf -m prep SDfile
Find this compound or compounds like it in BindingDB:
Activity Spreadsheet -- Enzyme Inhibition Constant Data from BindingDB
Found 2 hits for monomerid = 50005575
TargetSodium-dependent dopamine transporter(Rattus norvegicus (rat))
Research Triangle Institute
Curated by ChEMBL
LigandPNGBDBM50005575(3-Benzoyloxy-8-methyl-8-aza-bicyclo[3.2.1]octane-2...)
Affinity DataIC50:  72nM. Assay description: Inhibition of [3H]WIN-35248 binding to the dopamine transporter in rat striatal membranes.
In DepthDetails ArticlePubMed
TargetSodium-dependent dopamine transporter(Rattus norvegicus (rat))
Research Triangle Institute
Curated by ChEMBL
LigandPNGBDBM50005575(3-Benzoyloxy-8-methyl-8-aza-bicyclo[3.2.1]octane-2...)
Affinity DataIC50:  71nM. Assay description: Inhibition of [3H]WIN-35428 binding to the dopamine transporter
In DepthDetails ArticlePubMed