BDBM50005707 CHEMBL3235458
SMILES CC1CCN(CCCOc2ccc3CCC(=O)N(Cc4ccc(C)cc4)c3c2)CC1
InChI Key InChIKey=YXRRCGOKLVJPKW-UHFFFAOYSA-N
Data  1 KI
  Tab Delimited (TSV)   2D SDfile   Computed 3D by Vconf -m prep SDfile
Find this compound or compounds like it in BindingDB:
Activity Spreadsheet -- Enzyme Inhibition Constant Data from BindingDB
Found 1 hit for monomerid = 50005707
TargetSigma non-opioid intracellular receptor 1(Cavia porcellus (Guinea pig))
Huazhong University Of Science And Technology
Curated by ChEMBL
LigandPNGBDBM50005707(CHEMBL3235458)
Affinity DataKi:  1.5nM. Assay description: Displacement of [3H]-(+)-pentazocine from sigma 1 receptor in Dunkin Hartley guinea pig membrane after 180 mins by liquid scintillation counting anal...
In DepthDetails ArticlePubMed