BDBM50005718 CHEMBL25868::Phosphoric acid mono-{4-[(3-amino-2-fluoro-propoxyimino)-methyl]-5-hydroxy-6-methyl-pyridin-3-ylmethyl} ester
SMILES Cc1ncc(COP(O)(O)=O)c(\C=N\OCC(F)CN)c1O
InChI Key InChIKey=ZJLIUARGRQACPP-SYZQJQIISA-N
Data  1 IC50
  Tab Delimited (TSV)   2D SDfile   Computed 3D by Vconf -m prep SDfile
Find this compound or compounds like it in BindingDB:
Activity Spreadsheet -- Enzyme Inhibition Constant Data from BindingDB
Found 1 hit for monomerid = 50005718
TargetOrnithine decarboxylase(Rattus norvegicus)
Ciba-Geigy
Curated by ChEMBL
LigandPNGBDBM50005718(CHEMBL25868 | Phosphoric acid mono-{4-[(3-amino-2-...)
Affinity DataIC50:  5.20E+3nM. Assay description: Inhibitory activity against Rat liver ornithine decarboxylase(ODC)
In DepthDetails ArticlePubMed