BDBM50005774 (+/-)-Propyl-carbamic acid 1-ethyl-1,2,3,3a,8,8a-hexahydro-1-aza-cyclopenta[a]inden-5-yl ester::CHEMBL32653
SMILES CCCNC(=O)Oc1ccc2CC3[C@@H](CCN3CC)c2c1
InChI Key InChIKey=GFYHFMVUVHAJDW-LBAUFKAWSA-N
Data  2 IC50
  Tab Delimited (TSV)   2D SDfile   Computed 3D by Vconf -m prep SDfile
Find this compound or compounds like it in BindingDB:
Activity Spreadsheet -- Enzyme Inhibition Constant Data from BindingDB
Found 2 hits for monomerid = 50005774
TargetAcetylcholinesterase(Homo sapiens (Human))
Pfizer
Curated by ChEMBL
LigandPNGBDBM50005774((+/-)-Propyl-carbamic acid 1-ethyl-1,2,3,3a,8,8a-h...)
Affinity DataIC50:  2.19E+3nM. Assay description: In vitro inhibitory activity against human AchE (Acetylcholinesterase)
In DepthDetails ArticlePubMed
TargetAcetylcholinesterase(Homo sapiens (Human))
Pfizer
Curated by ChEMBL
LigandPNGBDBM50005774((+/-)-Propyl-carbamic acid 1-ethyl-1,2,3,3a,8,8a-h...)
Affinity DataIC50:  2.19E+3nM. Assay description: Inhibition of AChE
In DepthDetails ArticlePubMed