BDBM50005776 (+/-)-Butyl-carbamic acid 1-ethyl-3a-methyl-1,2,3,3a,8,8a-hexahydro-1-aza-cyclopenta[a]inden-5-yl ester::CHEMBL32452
SMILES CCCCNC(=O)Oc1ccc2CC3N(CC)CC[C@@]3(C)c2c1
InChI Key InChIKey=OEQMWEPWWKQKQL-NNBQYGFHSA-N
Data  1 IC50
  Tab Delimited (TSV)   2D SDfile   Computed 3D by Vconf -m prep SDfile
Find this compound or compounds like it in BindingDB:
Activity Spreadsheet -- Enzyme Inhibition Constant Data from BindingDB
Found 1 hit for monomerid = 50005776
TargetAcetylcholinesterase(Homo sapiens (Human))
Pfizer
Curated by ChEMBL
LigandPNGBDBM50005776((+/-)-Butyl-carbamic acid 1-ethyl-3a-methyl-1,2,3,...)
Affinity DataIC50:  90nM. Assay description: In vitro inhibitory activity against human Acetylcholinesterase
In DepthDetails ArticlePubMed