BDBM50005804 2,8-Diamino-3-(4-methoxy-benzyl)-1,9-dihydro-purin-6-one::CHEMBL36178
SMILES COc1ccc(Cn2c(N)nc(O)c3nc(N)nc23)cc1
InChI Key InChIKey=KIUFYEYEVITAAW-UHFFFAOYSA-N
Data  1 IC50
  Tab Delimited (TSV)   2D SDfile   Computed 3D by Vconf -m prep SDfile
Find this compound or compounds like it in BindingDB:
Activity Spreadsheet -- Enzyme Inhibition Constant Data from BindingDB
Found 1 hit for monomerid = 50005804
TargetPurine nucleoside phosphorylase(Homo sapiens (Human))
Warner-Lambert
Curated by ChEMBL
LigandPNGBDBM50005804(2,8-Diamino-3-(4-methoxy-benzyl)-1,9-dihydro-purin...)
Affinity DataIC50:  8.90E+3nM. Assay description: Inhibitory activity against Purine nucleoside phosphorylase evaluated by radiochemical assay
In DepthDetails ArticlePubMed