BDBM50005871 10,13-Dimethyl-4-methylsulfanyl-1,6,7,8,9,10,11,12,13,14,15,16-dodecahydro-2H-cyclopenta[a]phenanthrene-3,17-dione::CHEMBL39248
SMILES CSC1=C2CCC3C4CCC(=O)[C@@]4(C)CCC3[C@@]2(C)CCC1=O
InChI Key InChIKey=BZYIICZUVPPSEB-YGHRKMAYSA-N
Data  1 KI  1 IC50
  Tab Delimited (TSV)   2D SDfile   Computed 3D by Vconf -m prep SDfile
Find this compound or compounds like it in BindingDB:
Activity Spreadsheet -- Enzyme Inhibition Constant Data from BindingDB
Found 2 hits for monomerid = 50005871
TargetAromatase(Homo sapiens (Human))
TBA
Curated by ChEMBL
LigandPNGBDBM50005871(10,13-Dimethyl-4-methylsulfanyl-1,6,7,8,9,10,11,12...)
Affinity DataKi:  59nM. Assay description: Evaluated for its competitive inhibitory activity against Cytochrome P450 19A1 with the use of human placental microsomal preparation
In DepthDetails ArticlePubMed
TargetAromatase(Homo sapiens (Human))
TBA
Curated by ChEMBL
LigandPNGBDBM50005871(10,13-Dimethyl-4-methylsulfanyl-1,6,7,8,9,10,11,12...)
Affinity DataIC50:  4.40E+3nM. Assay description: Inhibition of cytochrome P450 19A1
In DepthDetails ArticlePubMed