BDBM50005907 1-Hydroxy-2-isobutyl-8-methoxy-anthraquinone::CHEMBL288236
SMILES COc1cccc2C(=O)c3ccc(CC(C)C)c(O)c3C(=O)c12
InChI Key InChIKey=XZQGIFIIFDCRPF-UHFFFAOYSA-N
Data  1 IC50
  Tab Delimited (TSV)   2D SDfile   Computed 3D by Vconf -m prep SDfile
Find this compound or compounds like it in BindingDB:
Activity Spreadsheet -- Enzyme Inhibition Constant Data from BindingDB
Found 1 hit for monomerid = 50005907
TargetNeutrophil elastase(Homo sapiens (Human))
Georgia Institute Of Technology
Curated by ChEMBL
LigandPNGBDBM50005907(1-Hydroxy-2-isobutyl-8-methoxy-anthraquinone | CHE...)
Affinity DataIC50:  1.10E+4nM. Assay description: In vitro inhibition of human leukocyte elastase.
In DepthDetails ArticlePubMed