BDBM50005932 CHEMBL40527::Octadec-9-enoic acid (2-isopropyl-6-methyl-phenyl)-amide
SMILES CCCCCCCC\C=C\CCCCCCCC(=O)Nc1c(C)cccc1C(C)C
InChI Key InChIKey=PKZYGOOSQHFETJ-OUKQBFOZSA-N
Data  1 IC50
  Tab Delimited (TSV)   2D SDfile   Computed 3D by Vconf -m prep SDfile
Find this compound or compounds like it in BindingDB:
Activity Spreadsheet -- Enzyme Inhibition Constant Data from BindingDB
Found 1 hit for monomerid = 50005932
TargetAcyl-CoA:cholesterol acyltransferase(Oryctolagus cuniculus)
Warner-Lambert
Curated by ChEMBL
LigandPNGBDBM50005932(CHEMBL40527 | Octadec-9-enoic acid (2-isopropyl-6-...)
Affinity DataIC50:  23nM. Assay description: In vitro inhibition of acyl coenzyme A:cholesterol acyltransferase, in intestinal microsomes isolated from cholesterol-fed rabbits
In DepthDetails ArticlePubMed