BDBM50005937 2,4-Dimethoxy-5-octadec-9-enoylamino-benzoic acid methyl ester::CHEMBL44314
SMILES CCCCCCCC\C=C\CCCCCCCC(=O)Nc1cc(C(=O)OC)c(OC)cc1OC
InChI Key InChIKey=WUKITRXOUJMPPM-OUKQBFOZSA-N
Data  1 IC50
  Tab Delimited (TSV)   2D SDfile   Computed 3D by Vconf -m prep SDfile
Find this compound or compounds like it in BindingDB:
Activity Spreadsheet -- Enzyme Inhibition Constant Data from BindingDB
Found 1 hit for monomerid = 50005937
TargetAcyl-CoA:cholesterol acyltransferase(Oryctolagus cuniculus)
Warner-Lambert
Curated by ChEMBL
LigandPNGBDBM50005937(2,4-Dimethoxy-5-octadec-9-enoylamino-benzoic acid ...)
Affinity DataIC50:  1.10E+3nM. Assay description: In vitro inhibition of acyl coenzyme A:cholesterol acyltransferase, in intestinal microsomes isolated from cholesterol-fed rabbits
In DepthDetails ArticlePubMed