BDBM50005954 1-Decyl-cyclobutanecarboxylic acid (2,4,6-trimethoxy-phenyl)-amide::CHEMBL42574
SMILES CCCCCCCCCCC1(CCC1)C(=O)Nc1c(OC)cc(OC)cc1OC
InChI Key InChIKey=BGMWCCABWUXFCX-UHFFFAOYSA-N
Data  1 IC50
  Tab Delimited (TSV)   2D SDfile   Computed 3D by Vconf -m prep SDfile
Find this compound or compounds like it in BindingDB:
Activity Spreadsheet -- Enzyme Inhibition Constant Data from BindingDB
Found 1 hit for monomerid = 50005954
TargetAcyl-CoA:cholesterol acyltransferase(Oryctolagus cuniculus)
Warner-Lambert
Curated by ChEMBL
LigandPNGBDBM50005954(1-Decyl-cyclobutanecarboxylic acid (2,4,6-trimetho...)
Affinity DataIC50:  39nM. Assay description: In vitro inhibition of acyl coenzyme A:cholesterol acyltransferase, in intestinal microsomes isolated from cholesterol-fed rabbits
In DepthDetails ArticlePubMed