BDBM50005956 CHEMBL44179::Octadec-9-enoic acid (2-methoxy-phenyl)-amide
SMILES CCCCCCCC\C=C\CCCCCCCC(=O)Nc1ccccc1OC
InChI Key InChIKey=FJERHVLKBNIHDM-ZHACJKMWSA-N
Data  1 IC50
  Tab Delimited (TSV)   2D SDfile   Computed 3D by Vconf -m prep SDfile
Find this compound or compounds like it in BindingDB:
Activity Spreadsheet -- Enzyme Inhibition Constant Data from BindingDB
Found 1 hit for monomerid = 50005956
TargetAcyl-CoA:cholesterol acyltransferase(Oryctolagus cuniculus)
Warner-Lambert
Curated by ChEMBL
LigandPNGBDBM50005956(CHEMBL44179 | Octadec-9-enoic acid (2-methoxy-phen...)
Affinity DataIC50:  8.00E+3nM. Assay description: In vitro inhibition of acyl coenzyme A:cholesterol acyltransferase, in intestinal microsomes isolated from cholesterol-fed rabbits
In DepthDetails ArticlePubMed