BDBM50006030 3-[3-({3-[2-(2-Decyloxy-ethoxy)-ethoxy]-2-methoxy-propoxy}-hydroxy-phosphoryloxy)-benzyl]-thiazol-3-ium::CHEMBL296849
SMILES CCCCCCCCCCOCCOCCOCC(COP([O-])(=O)Oc1cccc(C[n+]2ccsc2)c1)OC
InChI Key InChIKey=CCQNGJXDNJXCIZ-UHFFFAOYSA-N
Data  1 IC50
  Tab Delimited (TSV)   2D SDfile   Computed 3D by Vconf -m prep SDfile
Find this compound or compounds like it in BindingDB:
Activity Spreadsheet -- Enzyme Inhibition Constant Data from BindingDB
Found 1 hit for monomerid = 50006030
TargetPlatelet-activating factor receptor(Cavia porcellus)
American Cyanamid
Curated by ChEMBL
LigandPNGBDBM50006030(3-[3-({3-[2-(2-Decyloxy-ethoxy)-ethoxy]-2-methoxy-...)
Affinity DataIC50:  6.97E+3nM. Assay description: Inhibition of PAF induced platelet aggregation in rabbit
In DepthDetails ArticlePubMed