BDBM50006058 3-(3-{Hydroxy-[2-methoxy-3-(4-tetradecyl-phenoxy)-propoxy]-phosphoryloxy}-benzyl)-thiazol-3-ium::CHEMBL297778
SMILES CCCCCCCCCCCCCCc1ccc(OCC(COP([O-])(=O)Oc2cccc(C[n+]3ccsc3)c2)OC)cc1
InChI Key InChIKey=QPDYJPHKFBUDNG-UHFFFAOYSA-N
Data  1 IC50
  Tab Delimited (TSV)   2D SDfile   Computed 3D by Vconf -m prep SDfile
Find this compound or compounds like it in BindingDB:
Activity Spreadsheet -- Enzyme Inhibition Constant Data from BindingDB
Found 1 hit for monomerid = 50006058
TargetPlatelet-activating factor receptor(Cavia porcellus)
American Cyanamid
Curated by ChEMBL
LigandPNGBDBM50006058(3-(3-{Hydroxy-[2-methoxy-3-(4-tetradecyl-phenoxy)-...)
Affinity DataIC50:  2.85E+3nM. Assay description: Inhibition of PAF induced platelet aggregation in rabbit
In DepthDetails ArticlePubMed