BDBM50006070 3-(3-{[3-(4-Dodecyloxy-naphthalen-1-yloxy)-2-methoxy-propoxy]-hydroxy-phosphoryloxy}-benzyl)-thiazol-3-ium::CHEMBL47531
SMILES CCCCCCCCCCCCOc1ccc(OCC(COP([O-])(=O)Oc2cccc(C[n+]3ccsc3)c2)OC)c2ccccc12
InChI Key InChIKey=MUMHNTBBBBMJHU-UHFFFAOYSA-N
Data  1 IC50
  Tab Delimited (TSV)   2D SDfile   Computed 3D by Vconf -m prep SDfile
Find this compound or compounds like it in BindingDB:
Activity Spreadsheet -- Enzyme Inhibition Constant Data from BindingDB
Found 1 hit for monomerid = 50006070
TargetPlatelet-activating factor receptor(Cavia porcellus)
American Cyanamid
Curated by ChEMBL
LigandPNGBDBM50006070(3-(3-{[3-(4-Dodecyloxy-naphthalen-1-yloxy)-2-metho...)
Affinity DataIC50:  3.80E+3nM. Assay description: Inhibition of PAF induced platelet aggregation in rabbit
In DepthDetails ArticlePubMed