BDBM50006129 2-Benzyl-3-(morpholine-4-carbonyl)-cyclopropanecarboxylic acid [1-(1-cyclohexylmethyl-2,3-dihydroxy-5-methyl-hexylcarbamoyl)-2-thiazol-4-yl-ethyl]-amide::CHEMBL296702
SMILES CC(C)C[C@H](O)[C@H](O)[C@H](CC1CCCCC1)NC(=O)[C@H](Cc1cscn1)NC(=O)[C@@H]1[C@H](Cc2ccccc2)[C@H]1C(=O)N1CCOCC1
InChI Key InChIKey=DDPPBKSFIPPHAN-OSJIZEKLSA-N
Data  1 IC50
  Tab Delimited (TSV)   2D SDfile   Computed 3D by Vconf -m prep SDfile
Find this compound or compounds like it in BindingDB:
Activity Spreadsheet -- Enzyme Inhibition Constant Data from BindingDB
Found 1 hit for monomerid = 50006129
TargetRenin(Homo sapiens (Human))
University Of Texas
Curated by ChEMBL
LigandPNGBDBM50006129(2-Benzyl-3-(morpholine-4-carbonyl)-cyclopropanecar...)
Affinity DataIC50:  120nMpH: 6.0Assay Description:In vitro inhibition of purified human renin at a pH of 6.0.
In DepthDetails ArticlePubMed