BDBM50006139 2-Isobutyl-3-(morpholine-4-carbonyl)-cyclopropanecarboxylic acid [1-(1-cyclohexylmethyl-2,3-dihydroxy-5-methyl-hexylcarbamoyl)-2-thiazol-4-yl-ethyl]-amide::CHEMBL295544
SMILES CC(C)C[C@H](O)[C@H](O)[C@H](CC1CCCCC1)NC(=O)[C@H](Cc1cscn1)NC(=O)[C@H]1[C@H](CC(C)C)[C@@H]1C(=O)N1CCOCC1
InChI Key InChIKey=KALQXTCVCGUSCK-YFYZGSBZSA-N
Data  1 IC50
  Tab Delimited (TSV)   2D SDfile   Computed 3D by Vconf -m prep SDfile
Find this compound or compounds like it in BindingDB:
Activity Spreadsheet -- Enzyme Inhibition Constant Data from BindingDB
Found 1 hit for monomerid = 50006139
TargetRenin(Homo sapiens (Human))
University Of Texas
Curated by ChEMBL
LigandPNGBDBM50006139(2-Isobutyl-3-(morpholine-4-carbonyl)-cyclopropanec...)
Affinity DataIC50:  44nMpH: 6.0Assay Description:In vitro inhibition of purified human renin at a pH of 6.0.
In DepthDetails ArticlePubMed