BDBM50006236 3-Benzoyloxy-8-methyl-8-aza-bicyclo[3.2.1]octane-2-carboxylic acid 2-[4-(2-bromo-acetylamino)-phenyl]-ethyl ester
SMILES CN1C2CCC1[C@H]([C@H](C2)OC(=O)c1ccccc1)C(=O)OCCc1ccc(NC(=O)CBr)cc1
InChI Key InChIKey=OXRXFSKNIHGCRU-WNACPCLMSA-N
Data  1 IC50
  Tab Delimited (TSV)   2D SDfile   Computed 3D by Vconf -m prep SDfile
Find this compound or compounds like it in BindingDB:
Activity Spreadsheet -- Enzyme Inhibition Constant Data from BindingDB
Found 1 hit for monomerid = 50006236
TargetSodium-dependent dopamine transporter(Rattus norvegicus (rat))
Research Triangle Institute
Curated by ChEMBL
LigandPNGBDBM50006236(3-Benzoyloxy-8-methyl-8-aza-bicyclo[3.2.1]octane-2...)
Affinity DataIC50:  61nM. Assay description: Inhibition of [3H]WIN-35248 binding to the dopamine transporter in rat striatal membranes.
In DepthDetails ArticlePubMed