BDBM50006281 6-Carboxymethyl-12-(3-guanidino-propyl)-15-methyl-5,8,11,14,17-pentaoxo-1-thia-4,7,10,13,16-pentaaza-cyclooctadecane-3-carboxylic acid::CHEMBL62458
SMILES C[C@H]1NC(=O)CSC[C@H](NC(=O)[C@H](CC(O)=O)NC(=O)CNC(=O)[C@H](CCCNC(N)=N)NC1=O)C(O)=O
InChI Key InChIKey=RNRNOOHZNNWVAO-RHYQMDGZSA-N
Data  2 IC50
  Tab Delimited (TSV)   2D SDfile   Computed 3D by Vconf -m prep SDfile
Find this compound or compounds like it in BindingDB:
Activity Spreadsheet -- Enzyme Inhibition Constant Data from BindingDB
Found 2 hits for monomerid = 50006281
TargetIntegrin alpha-IIb/beta-3(Homo sapiens (Human))
Genentech
Curated by ChEMBL
LigandPNGBDBM50006281(6-Carboxymethyl-12-(3-guanidino-propyl)-15-methyl-...)
Affinity DataIC50:  4.00E+3nM. Assay description: Inhibition of ADP-induced platelet aggregation in human platelet-rich plasma
In DepthDetails ArticlePubMed
TargetIntegrin alpha-IIb/beta-3(Homo sapiens (Human))
Genentech
Curated by ChEMBL
LigandPNGBDBM50006281(6-Carboxymethyl-12-(3-guanidino-propyl)-15-methyl-...)
Affinity DataIC50:  9.5nM. Assay description: Inhibition of ADP-induced platelet aggregation in human platelet-rich plasma
In DepthDetails ArticlePubMed