BDBM50006311 15-(2-Carboxy-ethyl)-6-carboxymethyl-12-(3-guanidino-propyl)-5,8,11,14,17-pentaoxo-1-thia-4,7,10,13,16-pentaaza-cyclooctadecane-3-carboxylic acid::CHEMBL65370
SMILES NC(=N)NCCC[C@@H]1NC(=O)[C@@H](CCC(O)=O)NC(=O)CSC[C@H](NC(=O)[C@H](CC(O)=O)NC(=O)CNC1=O)C(O)=O
InChI Key InChIKey=BOHIOMJEXMWHQC-RNJOBUHISA-N
Data  1 IC50
  Tab Delimited (TSV)   2D SDfile   Computed 3D by Vconf -m prep SDfile
Find this compound or compounds like it in BindingDB:
Activity Spreadsheet -- Enzyme Inhibition Constant Data from BindingDB
Found 1 hit for monomerid = 50006311
TargetIntegrin alpha-IIb/beta-3(Homo sapiens (Human))
Genentech
Curated by ChEMBL
LigandPNGBDBM50006311(15-(2-Carboxy-ethyl)-6-carboxymethyl-12-(3-guanidi...)
Affinity DataIC50:  260nM. Assay description: The compound was tested for the inhibition of fibrinogen receptor
In DepthDetails ArticlePubMed