BDBM50006312 CHEMBL3234693
SMILES CCNC(=O)c1c(NC(=O)C23CC4CC(CC(C4)C2)C3)sc2COCCc12
InChI Key InChIKey=LMWLNSZOJQLZKJ-UHFFFAOYSA-N
Data  2 EC50
  Tab Delimited (TSV)   2D SDfile   Computed 3D by Vconf -m prep SDfile
Find this compound or compounds like it in BindingDB:
Activity Spreadsheet -- Enzyme Inhibition Constant Data from BindingDB
Found 2 hits for monomerid = 50006312
TargetCannabinoid receptor 2(Homo sapiens (Human))
Arena Pharmaceuticals
Curated by ChEMBL
LigandPNGBDBM50006312(CHEMBL3234693)
Affinity DataEC50:  21nM. Assay description: Displacement of [3H]-CP55940 from human CB2 receptor expressed in HEK293 cells after 90 mins by liquid scintillation counting
In DepthDetails ArticlePubMed
TargetCannabinoid receptor 1(Homo sapiens (Human))
Arena Pharmaceuticals
Curated by ChEMBL
LigandPNGBDBM50006312(CHEMBL3234693)
Affinity DataEC50: >1.5nM. Assay description: Displacement of [3H]-CP55940 from human CB1 receptor expressed in HEK293 cells after 90 mins by liquid scintillation counting
In DepthDetails ArticlePubMed