BDBM50006328 6-Carboxymethyl-12-(3-guanidino-propyl)-18-naphthalen-1-yl-5,8,11,14,17-pentaoxo-1-thia-4,7,10,13,16-pentaaza-cyclooctadecane-3-carboxylic acid::CHEMBL62969
SMILES NC(=N)NCCC[C@@H]1NC(=O)CNC(=O)C(SC[C@H](NC(=O)[C@H](CC(O)=O)NC(=O)CNC1=O)C(O)=O)c1cccc2ccccc12
InChI Key InChIKey=RUZPDEXRJNESMI-RBIKLVAFSA-N
Data  4 IC50
  Tab Delimited (TSV)   2D SDfile   Computed 3D by Vconf -m prep SDfile
Find this compound or compounds like it in BindingDB:
Activity Spreadsheet -- Enzyme Inhibition Constant Data from BindingDB
Found 4 hits for monomerid = 50006328
TargetIntegrin alpha-IIb/beta-3(Homo sapiens (Human))
Genentech
Curated by ChEMBL
LigandPNGBDBM50006328(6-Carboxymethyl-12-(3-guanidino-propyl)-18-naphtha...)
Affinity DataIC50:  780nM. Assay description: Inhibition of ADP-induced platelet aggregation in human platelet-rich plasma
In DepthDetails ArticlePubMed
TargetIntegrin alpha-IIb/beta-3(Homo sapiens (Human))
Genentech
Curated by ChEMBL
LigandPNGBDBM50006328(6-Carboxymethyl-12-(3-guanidino-propyl)-18-naphtha...)
Affinity DataIC50:  5.30nM. Assay description: The compound was tested for the inhibition of fibrinogen receptor
In DepthDetails ArticlePubMed
TargetIntegrin alpha-IIb/beta-3(Homo sapiens (Human))
Genentech
Curated by ChEMBL
LigandPNGBDBM50006328(6-Carboxymethyl-12-(3-guanidino-propyl)-18-naphtha...)
Affinity DataIC50:  5.30nM. Assay description: The compound was tested for the inhibition of fibrinogen receptor
In DepthDetails ArticlePubMed
TargetIntegrin alpha-IIb/beta-3(Homo sapiens (Human))
Genentech
Curated by ChEMBL
LigandPNGBDBM50006328(6-Carboxymethyl-12-(3-guanidino-propyl)-18-naphtha...)
Affinity DataIC50:  780nM. Assay description: Inhibition of ADP-induced platelet aggregation in human platelet-rich plasma
In DepthDetails ArticlePubMed