BDBM50006392 6',8'-dichloro-7'-methoxy-3'-methyl-1'H,2H,5H-spiro[imidazolidine-4,4'-quinazoline]-2,2',5(3'H)-trione::CHEMBL292998
SMILES COc1c(Cl)cc2c(NC(=O)N(C)C22NC(=O)NC2=O)c1Cl
InChI Key InChIKey=WPEXKNMOONRYQB-UHFFFAOYSA-N
Data  1 IC50
  Tab Delimited (TSV)   2D SDfile   Computed 3D by Vconf -m prep SDfile
Find this compound or compounds like it in BindingDB:
Activity Spreadsheet -- Enzyme Inhibition Constant Data from BindingDB
Found 1 hit for monomerid = 50006392
TargetAldo-keto reductase family 1 member B1(Homo sapiens (Human))
Tanabe Seiyaku
Curated by ChEMBL
LigandPNGBDBM50006392(6',8'-dichloro-7'-methoxy-3'-methyl-1'H,2H,5H-spir...)
Affinity DataIC50:  72nM. Assay description: Tested in vitro for inhibitory activity against partially purified aldose reductase from male rabbit lens
In DepthDetails ArticlePubMed