BDBM50006409 CHEMBL2367478::Sodium; 7-[5-(4-fluoro-phenyl)-3-isopropyl-1-phenyl-1H-pyrazol-4-yl]-3,5-dihydroxy-hept-6-enoate
SMILES [Na+].CC(C)c1nn(c(c1\C=C\[C@@H](O)C[C@@H](O)CC([O-])=O)-c1ccc(F)cc1)-c1ccccc1
InChI Key InChIKey=ABNXPCBQPDGROH-VRHXWEEISA-M
Data  2 IC50
  Tab Delimited (TSV)   2D SDfile   Computed 3D by Vconf -m prep SDfile
Find this compound or compounds like it in BindingDB:
Activity Spreadsheet -- Enzyme Inhibition Constant Data from BindingDB
Found 2 hits for monomerid = 50006409
Target3-hydroxy-3-methylglutaryl-coenzyme A reductase(Homo sapiens (Human))
Warner-Lambert
Curated by ChEMBL
LigandPNGBDBM50006409(CHEMBL2367478 | Sodium; 7-[5-(4-fluoro-phenyl)-3-i...)
Affinity DataIC50:  7nM. Assay description: Tested in vitro for the inhibition of HMG-CoA reductase from partially purified microsomal preparations.
In DepthDetails ArticlePubMed
Target3-hydroxy-3-methylglutaryl-coenzyme A reductase(Rattus norvegicus (rat))
Warner-Lambert
Curated by ChEMBL
LigandPNGBDBM50006409(CHEMBL2367478 | Sodium; 7-[5-(4-fluoro-phenyl)-3-i...)
Affinity DataIC50:  7.20nM. Assay description: Ability to inhibit microsomal preparation of HMG-CoA reductase in rat liver.
In DepthDetails ArticlePubMed