BDBM50006428 CHEMBL68464::{1-[1-(1-Cyclohexylmethyl-2-hydroxy-3-{1-[(2-morpholin-4-yl-ethylcarbamoyl)-methyl]-1H-tetrazol-5-ylsulfanyl}-propylcarbamoyl)-2-(1H-imidazol-4-yl)-ethylcarbamoyl]-2-phenyl-ethyl}-carbamic acid tert-butyl ester; hydrate
SMILES CC(C)(C)OC(=O)N[C@@H](Cc1ccccc1)C(=O)N[C@@H](Cc1cnc[nH]1)C(=O)N[C@@H](CC1CCCCC1)[C@@H](O)CSc1nnnn1CC(=O)NCCN1CCOCC1
InChI Key InChIKey=YFWKTARZGADHHD-YRCZKMHPSA-N
Data  1 IC50
  Tab Delimited (TSV)   2D SDfile   Computed 3D by Vconf -m prep SDfile
Find this compound or compounds like it in BindingDB:
Activity Spreadsheet -- Enzyme Inhibition Constant Data from BindingDB
Found 1 hit for monomerid = 50006428
TargetRenin(Homo sapiens (Human))
Merck Sharp & Dohme Research Laboratories
Curated by ChEMBL
LigandPNGBDBM50006428(CHEMBL68464 | {1-[1-(1-Cyclohexylmethyl-2-hydroxy-...)
Affinity DataIC50:  314nM. Assay description: The compound was tested in vitro for inhibition of human plasma renin.
In DepthDetails ArticlePubMed