BDBM50006435 (5-{3-[2-(2-tert-Butoxycarbonylamino-3-phenyl-propionylamino)-3-(1H-imidazol-4-yl)-propionylamino]-4-cyclohexyl-2-hydroxy-butylsulfanyl}-tetrazol-1-yl)-acetic acid::CHEMBL67827
SMILES CC(C)(C)OC(=O)N[C@@H](Cc1ccccc1)C(=O)N[C@@H](Cc1cnc[nH]1)C(=O)N[C@@H](CC1CCCCC1)[C@@H](O)CSc1nnnn1CC(O)=O
InChI Key InChIKey=ALVONKJSVBZOQC-FWEHEUNISA-N
Data  1 IC50
  Tab Delimited (TSV)   2D SDfile   Computed 3D by Vconf -m prep SDfile
Find this compound or compounds like it in BindingDB:
Activity Spreadsheet -- Enzyme Inhibition Constant Data from BindingDB
Found 1 hit for monomerid = 50006435
TargetRenin(Homo sapiens (Human))
Merck Sharp & Dohme Research Laboratories
Curated by ChEMBL
LigandPNGBDBM50006435((5-{3-[2-(2-tert-Butoxycarbonylamino-3-phenyl-prop...)
Affinity DataIC50:  396nM. Assay description: The compound was tested in vitro for inhibition of human plasma renin.
In DepthDetails ArticlePubMed