BDBM50006506 (6-Fluoro-4-hydroxy-2-methyl-chroman-4-yl)-acetic acid::CHEMBL71701
SMILES C[C@@H]1C[C@@](O)(CC(O)=O)c2cc(F)ccc2O1
InChI Key InChIKey=GVDRXEKBHSNMNM-JMCQJSRRSA-N
Data  2 IC50
  Tab Delimited (TSV)   2D SDfile   Computed 3D by Vconf -m prep SDfile
Find this compound or compounds like it in BindingDB:
Activity Spreadsheet -- Enzyme Inhibition Constant Data from BindingDB
Found 2 hits for monomerid = 50006506
TargetAldo-keto reductase family 1 member B1(Homo sapiens (Human))
Pfizer
Curated by ChEMBL
LigandPNGBDBM50006506((6-Fluoro-4-hydroxy-2-methyl-chroman-4-yl)-acetic ...)
Affinity DataIC50:  200nM. Assay description: Inhibitory activity against human placental aldose reductase
In DepthDetails ArticlePubMed
TargetAldo-keto reductase family 1 member B1(Homo sapiens (Human))
Pfizer
Curated by ChEMBL
LigandPNGBDBM50006506((6-Fluoro-4-hydroxy-2-methyl-chroman-4-yl)-acetic ...)
Affinity DataIC50:  310nM. Assay description: Compound was tested in vitro for its inhibitory activity against human placental aldose reductase
In DepthDetails ArticlePubMed