BDBM50006516 (5-Bromo-6-fluoro-4-hydroxy-2-methyl-chroman-4-yl)-acetic acid::CHEMBL420550
SMILES C[C@@H]1C[C@@](O)(CC(O)=O)c2c(Br)c(F)ccc2O1
InChI Key InChIKey=AMORGBZMDIASPV-SREIQFSDSA-N
Data  1 IC50
  Tab Delimited (TSV)   2D SDfile   Computed 3D by Vconf -m prep SDfile
Find this compound or compounds like it in BindingDB:
Activity Spreadsheet -- Enzyme Inhibition Constant Data from BindingDB
Found 1 hit for monomerid = 50006516
TargetAldo-keto reductase family 1 member B1(Homo sapiens (Human))
Pfizer
Curated by ChEMBL
LigandPNGBDBM50006516((5-Bromo-6-fluoro-4-hydroxy-2-methyl-chroman-4-yl)...)
Affinity DataIC50:  4.50E+3nM. Assay description: Inhibitory activity against human placental aldose reductase
In DepthDetails ArticlePubMed