BDBM50006543 3-(2-Iodo-benzoyloxy)-8-methyl-8-aza-bicyclo[3.2.1]octane-2-carboxylic acid methyl ester(o-iodococaine)::CHEMBL70115
SMILES COC(=O)C1C2CCC(C[C@@H]1OC(=O)c1ccccc1I)N2C
InChI Key InChIKey=AWVUKTXSKOZAJP-RCNMZAFISA-N
Data  1 IC50
  Tab Delimited (TSV)   2D SDfile   Computed 3D by Vconf -m prep SDfile
Find this compound or compounds like it in BindingDB:
Activity Spreadsheet -- Enzyme Inhibition Constant Data from BindingDB
Found 1 hit for monomerid = 50006543
TargetSodium-dependent dopamine transporter(Rattus norvegicus (rat))
Brookhaven National Laboratory
Curated by ChEMBL
LigandPNGBDBM50006543(3-(2-Iodo-benzoyloxy)-8-methyl-8-aza-bicyclo[3.2.1...)
Affinity DataIC50:  350nM. Assay description: Concentration of the compound inhibiting [3H]-Cocaine binding site to rat striatal membranes.
In DepthDetails ArticlePubMed