BDBM50006620 CHEMBL3235486
SMILES [O-][N+](=O)c1ccc2c(c1)-c1ccc(cc1S2(=O)=O)N1CCN2CCC1CC2
InChI Key InChIKey=WBOQGKDOKBETNS-UHFFFAOYSA-N
Data  1 KI
  Tab Delimited (TSV)   2D SDfile   Computed 3D by Vconf -m prep SDfile
Find this compound or compounds like it in BindingDB:
Activity Spreadsheet -- Enzyme Inhibition Constant Data from BindingDB
Found 1 hit for monomerid = 50006620
TargetNeuronal acetylcholine receptor subunit alpha-7(Rattus norvegicus (Rat))
The Johns Hopkins University School Of Medicine
Curated by ChEMBL
LigandPNGBDBM50006620(CHEMBL3235486)
Affinity DataKi:  3.40nM. Assay description: Displacement of [125I]alpha-bungarotoxin from rat cortical membrane alpha7-nAChR after 150 mins by gamma-counting analysis
In DepthDetails ArticlePubMed