BDBM50006692 2-{2,3-Difluoro-4-[(2-methyl-4-oxo-3,4-dihydro-quinazolin-6-ylmethyl)-prop-2-ynyl-amino]-benzoylamino}-pentanedioic acid ;hydrate(2H2O)::CHEMBL420204
SMILES Cc1nc2ccc(CN(CC#C)c3ccc(C(=O)N[C@@H](CCC(O)=O)C(O)=O)c(F)c3F)cc2c(=O)[nH]1
InChI Key InChIKey=HMVAVIHLGREXJV-UHFFFAOYSA-N
Data  1 IC50
  Tab Delimited (TSV)   2D SDfile   Computed 3D by Vconf -m prep SDfile
Find this compound or compounds like it in BindingDB:
Activity Spreadsheet -- Enzyme Inhibition Constant Data from BindingDB
Found 1 hit for monomerid = 50006692
TargetThymidylate synthase(Mus musculus)
Institute Of Cancer Research
Curated by ChEMBL
LigandPNGBDBM50006692(2-{2,3-Difluoro-4-[(2-methyl-4-oxo-3,4-dihydro-qui...)
Affinity DataIC50:  1.70E+3nM. Assay description: Inhibition of thymidylate synthase from L1210 cells
In DepthDetails ArticlePubMed