BDBM50006693 2-{2,5-Difluoro-4-[methyl-(2-methyl-4-oxo-3,4-dihydro-quinazolin-6-ylmethyl)-amino]-benzoylamino}-pentanedioic acid ;hydrate(H2O)::CHEMBL419092
SMILES CN(Cc1ccc2nc(C)[nH]c(=O)c2c1)c1cc(F)c(cc1F)C(=O)N[C@@H](CCC(O)=O)C(O)=O
InChI Key InChIKey=DBDUDTXGCJFRIQ-UHFFFAOYSA-N
Data  1 IC50
  Tab Delimited (TSV)   2D SDfile   Computed 3D by Vconf -m prep SDfile
Find this compound or compounds like it in BindingDB:
Activity Spreadsheet -- Enzyme Inhibition Constant Data from BindingDB
Found 1 hit for monomerid = 50006693
TargetThymidylate synthase(Mus musculus)
Institute Of Cancer Research
Curated by ChEMBL
LigandPNGBDBM50006693(2-{2,5-Difluoro-4-[methyl-(2-methyl-4-oxo-3,4-dihy...)
Affinity DataIC50:  1.10E+3nM. Assay description: Inhibition of thymidylate synthase from L1210 cells
In DepthDetails ArticlePubMed