BDBM50006716 1,3-Dimethyl-8-[2-(3,4,5-trimethoxy-phenyl)-vinyl]-3,7-dihydro-purine-2,6-dione::CHEMBL26979
SMILES COc1cc(C=Cc2nc3n(C)c(=O)n(C)c(=O)c3[nH]2)cc(OC)c1OC
InChI Key InChIKey=BPIQNFNKBYWCNB-UHFFFAOYSA-N
Data  4 KI
  Tab Delimited (TSV)   2D SDfile   Computed 3D by Vconf -m prep SDfile
Find this compound or compounds like it in BindingDB:
Activity Spreadsheet -- Enzyme Inhibition Constant Data from BindingDB
Found 4 hits for monomerid = 50006716
TargetAdenosine receptor A2a/A2b(Rattus norvegicus)
Kyowa Hakko Kogyo
Curated by ChEMBL
LigandPNGBDBM50006716(1,3-Dimethyl-8-[2-(3,4,5-trimethoxy-phenyl)-vinyl]...)
Affinity DataKi:  71nM. Assay description: Binding affinity against adenosine A2 receptor from rat striatal membranes, using N-[3H]-ethyladenosin-5''-uronamide as radioligand (in the presence ...
In DepthDetails ArticlePubMed
TargetAdenosine receptor A2a/A2b(Rattus norvegicus)
Kyowa Hakko Kogyo
Curated by ChEMBL
LigandPNGBDBM50006716(1,3-Dimethyl-8-[2-(3,4,5-trimethoxy-phenyl)-vinyl]...)
Affinity DataKi:  360nM. Assay description: Binding affinity against adenosine A2 receptor in rat brain using [3H]- CGS 21680 as radioligand
In DepthDetails ArticlePubMed
TargetAdenosine receptor A1(Rattus norvegicus (rat))
National Institute Of Diabetes
Curated by ChEMBL
LigandPNGBDBM50006716(1,3-Dimethyl-8-[2-(3,4,5-trimethoxy-phenyl)-vinyl]...)
Affinity DataKi: >2.28E+3nM. Assay description: Affinity against Adenosine A1 receptor in rat brain using [3H]- PIA as radioligand
In DepthDetails ArticlePubMed
TargetAdenosine receptor A1(GUINEA PIG)
Kyowa Hakko Kogyo
Curated by ChEMBL
LigandPNGBDBM50006716(1,3-Dimethyl-8-[2-(3,4,5-trimethoxy-phenyl)-vinyl]...)
Affinity DataKi: >1.00E+5nM. Assay description: Binding affinity against adenosine A1 receptor from guinea pig forebrain membranes, using N6-[3H]-cyclohexyladenosine as radioligand.
In DepthDetails ArticlePubMed