BDBM50006746 CHEMBL3236557
SMILES N[C@H]1CCN(C1)c1cc(nc(N)n1)C1CCCC1
InChI Key InChIKey=IOYMEVXWUXSZAX-JTQLQIEISA-N
Data  1 KI  1 EC50
  Tab Delimited (TSV)   2D SDfile   Computed 3D by Vconf -m prep SDfile
Find this compound or compounds like it in BindingDB:
Activity Spreadsheet -- Enzyme Inhibition Constant Data from BindingDB
Found 2 hits for monomerid = 50006746
TargetHistamine H4 receptor(Homo sapiens (Human))
Janssen Research And Development
Curated by ChEMBL
LigandPNGBDBM50006746(CHEMBL3236557)
Affinity DataKi:  36nM. Assay description: Displacement of [3H]histamine from human recombinant histamine H4 receptor expressed in SK-N-MC cells after 45 mins by competition binding analysis
In DepthDetails ArticlePubMed
TargetHistamine H4 receptor(Homo sapiens (Human))
Janssen Research And Development
Curated by ChEMBL
LigandPNGBDBM50006746(CHEMBL3236557)
Affinity DataEC50: >1.00E+4nM. Assay description: Agonist activity at human H4 receptor
In DepthDetails ArticlePubMed