BDBM50006779 3-(4-Iodo-phenyl)-8-methyl-8-aza-bicyclo[3.2.1]octane-2-carboxylic acid phenyl ester::CHEMBL313038
SMILES CN1[C@@H]2CCC1[C@H]([C@H](C2)c1ccc(I)cc1)C(=O)Oc1ccccc1
InChI Key InChIKey=YGQAUDOSACJSSX-AQZKVIQRSA-N
Data  3 IC50
  Tab Delimited (TSV)   2D SDfile   Computed 3D by Vconf -m prep SDfile
Find this compound or compounds like it in BindingDB:
Activity Spreadsheet -- Enzyme Inhibition Constant Data from BindingDB
Found 3 hits for monomerid = 50006779
TargetSodium-dependent serotonin transporter(Rattus norvegicus (rat))
Research Triangle Institute
Curated by ChEMBL
LigandPNGBDBM50006779(3-(4-Iodo-phenyl)-8-methyl-8-aza-bicyclo[3.2.1]oct...)
Affinity DataIC50:  326nM. Assay description: Inhibition of [3H]paroxetine binding to Serotonin transporter
In DepthDetails ArticlePubMed
TargetTransporter(Rattus norvegicus)
Research Triangle Institute
Curated by ChEMBL
LigandPNGBDBM50006779(3-(4-Iodo-phenyl)-8-methyl-8-aza-bicyclo[3.2.1]oct...)
Affinity DataIC50:  1.83E+4nM. Assay description: Inhibition of [3H]mazindol binding to Norepinephrine transporter
In DepthDetails ArticlePubMed
TargetSodium-dependent dopamine transporter(Rattus norvegicus (rat))
Research Triangle Institute
Curated by ChEMBL
LigandPNGBDBM50006779(3-(4-Iodo-phenyl)-8-methyl-8-aza-bicyclo[3.2.1]oct...)
Affinity DataIC50:  1.5nM. Assay description: Inhibition of [3H]WIN-35428l binding to Dopamine transporter
In DepthDetails ArticlePubMed