BDBM50006825 CHEMBL431023::{1-Benzyl-2-hydroxy-3-[1-(2-hydroxy-1-phenyl-ethylcarbamoyl)-2-phenyl-ethylamino]-propyl}-carbamic acid tert-butyl ester
SMILES CC(C)(C)OC(=O)N[C@@H](Cc1ccccc1)C(O)CNC(Cc1ccccc1)C(=O)NC(CO)c1ccccc1
InChI Key InChIKey=HRSKRFLJBFZQHV-ADHPVOFISA-N
Data  1 IC50
  Tab Delimited (TSV)   2D SDfile   Computed 3D by Vconf -m prep SDfile
Find this compound or compounds like it in BindingDB:
Activity Spreadsheet -- Enzyme Inhibition Constant Data from BindingDB
Found 1 hit for monomerid = 50006825
TargetGag-Pol polyprotein [489-587](Human immunodeficiency virus type 1)
Merck Research Laboratories
Curated by ChEMBL
LigandPNGBDBM50006825(CHEMBL431023 | {1-Benzyl-2-hydroxy-3-[1-(2-hydroxy...)
Affinity DataIC50:  3.80E+4nM. Assay description: Compound was evaluated in vitro for the inhibition of HIV protease, using a peptide hydrolysis assay
In DepthDetails ArticlePubMed